BDBM50025537 3,6-Dimethyl-4-{3-methyl-2-[3-methyl-2-(3-methyl-butyrylamino)-butyrylamino]-butyrylamino}-heptanoic acid [1-(3-methyl-butylcarbamoyl)-ethyl]-amide::CHEMBL3392089
SMILES CC(C)CCNC(=O)[C@H](C)NC(=O)C[C@H](C)[C@@H](CC(C)C)NC(=O)[C@@H](NC(=O)[C@@H](NC(=O)CC(C)C)C(C)C)C(C)C
InChI Key InChIKey=VBROOHAYFVCWQQ-GRBKXTSRSA-N
Data  1 KI
  Tab Delimited (TSV)   2D SDfile   Computed 3D by Vconf -m prep SDfile
Find this compound or compounds like it in BindingDB:
Activity Spreadsheet -- Enzyme Inhibition Constant Data from BindingDB
Found 1 hit for monomerid = 50025537
TargetCathepsin D(Bos taurus)
TBA
Curated by ChEMBL
LigandPNGBDBM50025537(3,6-Dimethyl-4-{3-methyl-2-[3-methyl-2-(3-methyl-b...)
Affinity DataKi:  214nM. Assay description: Inhibition of cathepsin D.
In DepthDetails ArticlePubMed