BDBM50025899 3-Hydroxy-4-[3-methyl-2-(3-methyl-butyrylamino)-butyrylamino]-5-phenyl-pentanoic acid [1-methyl-2-(4-methyl-pentanoylamino)-2-oxo-ethyl]-amide::CHEMBL92111
SMILES CC(C)CCC(=O)NC(=O)[C@H](C)NC(=O)CC(O)[C@@H](Cc1ccccc1)NC(=O)[C@H](NC(=O)CC(C)C)C(C)C
InChI Key InChIKey=ZGMYTGYIYYKJAT-WMFSVHMFSA-N
Data  1 KI
  Tab Delimited (TSV)   2D SDfile   Computed 3D by Vconf -m prep SDfile
Find this compound or compounds like it in BindingDB:
Activity Spreadsheet -- Enzyme Inhibition Constant Data from BindingDB
Found 1 hit for monomerid = 50025899
TargetPepsin A(Porcine)
TBA
Curated by ChEMBL
LigandPNGBDBM50025899(3-Hydroxy-4-[3-methyl-2-(3-methyl-butyrylamino)-bu...)
Affinity DataKi:  0.900nM. Assay description: Inhibition of porcine pepsin
In DepthDetails ArticlePubMed