BDBM50027360 5-Guanidino-2-{3-hydroxy-4-[2-(3-hydroxy-6-methyl-4-{3-methyl-2-[3-methyl-2-(3-methyl-butyrylamino)-butyrylamino]-butyrylamino}-heptanoylamino)-propionylamino]-6-methyl-heptanoylamino}-pentanoic acid::CHEMBL120658
SMILES CC(C)C[C@H](NC(=O)[C@H](C)NC(=O)CC(O)[C@H](CC(C)C)NC(=O)[C@@H](NC(=O)[C@@H](NC(=O)CC(C)C)C(C)C)C(C)C)C(O)CC(=O)N[C@@H](CCCNC(N)=N)C(O)=O
InChI Key InChIKey=AZCMMOULBWVNBF-ZYILYJJOSA-N
Data  1 KI
  Tab Delimited (TSV)   2D SDfile   Computed 3D by Vconf -m prep SDfile
Find this compound or compounds like it in BindingDB:
Activity Spreadsheet -- Enzyme Inhibition Constant Data from BindingDB
Found 1 hit for monomerid = 50027360
TargetRenin(Homo sapiens (Human))
TBA
Curated by ChEMBL
LigandPNGBDBM50027360(5-Guanidino-2-{3-hydroxy-4-[2-(3-hydroxy-6-methyl-...)
Affinity DataKi:  100nM. Assay description: Antihypertensive activity against human renin
In DepthDetails ArticlePubMed