BDBM50027904 3-Hydroxy-6-methyl-4-[3-methyl-2-(3-methyl-butyrylamino)-butyrylamino]-heptanoic acid [(3-methyl-butylcarbamoyl)-methyl]-amide::CHEMBL170060
SMILES CC(C)CCNC(=O)CNC(=O)CC(O)C(CC(C)C)NC(=O)C(NC(=O)CC(C)C)C(C)C
InChI Key InChIKey=TZZAKFIUSWUKPG-UHFFFAOYSA-N
Data  1 KI
  Tab Delimited (TSV)   2D SDfile   Computed 3D by Vconf -m prep SDfile
Find this compound or compounds like it in BindingDB:
Activity Spreadsheet -- Enzyme Inhibition Constant Data from BindingDB
Found 1 hit for monomerid = 50027904
TargetPepsin A(Porcine)
TBA
Curated by ChEMBL
LigandPNGBDBM50027904(3-Hydroxy-6-methyl-4-[3-methyl-2-(3-methyl-butyryl...)
Affinity DataKi:  56nM. Assay description: Tested for time independent inhibition constant against porcine pepsin
In DepthDetails ArticlePubMed