BDBM50028315 3-Hydroxy-6-methyl-4-[3-methyl-2-(3-methyl-butyrylamino)-butyrylamino]-heptanoic acid [1-(3-methyl-butylcarbamoyl)-ethyl]-amide::CHEMBL112015
SMILES CC(C)CCNC(=O)[C@H](C)NC(=O)CC(O)[C@@H](CC(C)C)NC(=O)[C@H](NC(=O)CC(C)C)C(C)C
InChI Key InChIKey=JQOFUZAKCVQZTH-QOSKVWGGSA-N
Data  1 KI
  Tab Delimited (TSV)   2D SDfile   Computed 3D by Vconf -m prep SDfile
Find this compound or compounds like it in BindingDB:
Activity Spreadsheet -- Enzyme Inhibition Constant Data from BindingDB
Found 1 hit for monomerid = 50028315
TargetPepsin A-5(Homo sapiens (Human))
TBA
Curated by ChEMBL
LigandPNGBDBM50028315(3-Hydroxy-6-methyl-4-[3-methyl-2-(3-methyl-butyryl...)
Affinity DataKi: >6.00E+3nM. Assay description: Pepsin inhibition using synthetic heptapeptide substrate Phe-Gly-His-Phe-(N02)-Phe-Ala- Phe-OMe
In DepthDetails ArticlePubMed