BDBM50027897 2-{2-[2-(2-Amino-4-methyl-pentanoylamino)-4-methyl-pentanoylamino]-3-methyl-butyrylamino}-3-phenyl-propionic acid methyl ester::CHEMBL1204164::CHEMBL25842
SMILES COC(=O)[C@H](Cc1ccccc1)NC(=O)[C@@H](NC(=O)[C@H](CC(C)C)NC(=O)[C@@H](N)CC(C)C)C(C)C
InChI Key InChIKey=CFEXIQJRXNWVLU-MLCQCVOFSA-N
Data  4 KI
  Tab Delimited (TSV)   2D SDfile   Computed 3D by Vconf -m prep SDfile
Find this compound or compounds like it in BindingDB:
Activity Spreadsheet -- Enzyme Inhibition Constant Data from BindingDB
Found 4 hits for monomerid = 50027897
TargetRenin(Homo sapiens (Human))
TBA
Curated by ChEMBL
LigandPNGBDBM50027897(2-{2-[2-(2-Amino-4-methyl-pentanoylamino)-4-methyl...)
Affinity DataKi:  5.00E+5nM. Assay description: Compound was evaluated for noncompetitive Renin inhibitory activity against hog kidney renin; Non competitive
In DepthDetails ArticlePubMed
TargetRenin(Homo sapiens (Human))
TBA
Curated by ChEMBL
LigandPNGBDBM50027897(2-{2-[2-(2-Amino-4-methyl-pentanoylamino)-4-methyl...)
Affinity DataKi:  1.14E+6nM. Assay description: Competitive inhibition of renin from human amniotic prorenin
In DepthDetails ArticlePubMed
TargetRenin(Homo sapiens (Human))
TBA
Curated by ChEMBL
LigandPNGBDBM50027897(2-{2-[2-(2-Amino-4-methyl-pentanoylamino)-4-methyl...)
Affinity DataKi:  1.14E+6nM. Assay description: Compound was evaluated for competitive Renin inhibitory activity against hog kidney renin; Non competitive
In DepthDetails ArticlePubMed
TargetRenin(Homo sapiens (Human))
TBA
Curated by ChEMBL
LigandPNGBDBM50027897(2-{2-[2-(2-Amino-4-methyl-pentanoylamino)-4-methyl...)
Affinity DataKi:  1.14E+6nM. Assay description: Inhibition of human amniotic renin was tested and determined by Dixon plots
In DepthDetails ArticlePubMed