BDBM50029197 CHEMBL134573::N-[2-(3,4-Dihydroxy-phenyl)-ethyl]-2-phenyl-acetamide
SMILES Oc1ccc(CCNC(=O)Cc2ccccc2)cc1O
InChI Key InChIKey=GGGICHWZMLXHLJ-UHFFFAOYSA-N
Data  1 IC50
  Tab Delimited (TSV)   2D SDfile   Computed 3D by Vconf -m prep SDfile
Find this compound or compounds like it in BindingDB:
Activity Spreadsheet -- Enzyme Inhibition Constant Data from BindingDB
Found 1 hit for monomerid = 50029197
TargetIntegrase(Human immunodeficiency virus 1)
National Cancer Institute-Bethesda
Curated by ChEMBL
LigandPNGBDBM50029197(CHEMBL134573 | N-[2-(3,4-Dihydroxy-phenyl)-ethyl]-...)
Affinity DataIC50: >1.00E+5nM. Assay description: In vitro inhibitory activity against HIV-1 integrase.
In DepthDetails ArticlePubMed