BDBM50029777 (S)-(-)-N-{3-[5-(4-fluorobenzyl)thien-2-yl]-1-methylprop-2-ynyl}-N-hydroxyurea::CHEMBL145306
SMILES C[C@@H](C#Cc1ccc(Cc2ccc(F)cc2)s1)N(O)C(N)=O
InChI Key InChIKey=MMSNEKOTSJRTRI-NSHDSACASA-N
Data  1 IC50
  Tab Delimited (TSV)   2D SDfile   Computed 3D by Vconf -m prep SDfile
Find this compound or compounds like it in BindingDB:
Activity Spreadsheet -- Enzyme Inhibition Constant Data from BindingDB
Found 1 hit for monomerid = 50029777
TargetPolyunsaturated fatty acid 5-lipoxygenase(Homo sapiens (Human))
Abbott Laboratories
Curated by ChEMBL
LigandPNGBDBM50029777((S)-(-)-N-{3-[5-(4-fluorobenzyl)thien-2-yl]-1-meth...)
Affinity DataIC50:  200nM. Assay description: 5-lipoxygenase Inhibitory activity was measured by enzyme immunoassay using human whole blood stimulated with calcium ionophore (A23187) and LTB4 (le...
In DepthDetails ArticlePubMed