BDBM50030596 3-{[(3,5-Bis-trifluoromethyl-benzyl)-methyl-amino]-methyl}-2-methyl-4-phenyl-2H-isoquinolin-1-one::CHEMBL107283
SMILES CN(Cc1cc(cc(c1)C(F)(F)F)C(F)(F)F)Cc1c(-c2ccccc2)c2ccccc2c(=O)n1C
InChI Key InChIKey=IOACPIKKSGPKPW-UHFFFAOYSA-N
Data  1 IC50
  Tab Delimited (TSV)   2D SDfile   Computed 3D by Vconf -m prep SDfile
Find this compound or compounds like it in BindingDB:
Activity Spreadsheet -- Enzyme Inhibition Constant Data from BindingDB
Found 1 hit for monomerid = 50030596
TargetSubstance-P receptor(Homo sapiens (Human))
Takeda Chemical Industries
Curated by ChEMBL
LigandPNGBDBM50030596(3-{[(3,5-Bis-trifluoromethyl-benzyl)-methyl-amino]...)
Affinity DataIC50:  600nM. Assay description: Inhibition of [125I]-BH-Substance P binding to tachykinin receptor 1 in human IM-9 cells
In DepthDetails ArticlePubMed