BDBM50034935 6-{[(2,4-Dimethoxy-phenyl)-methyl-amino]-methyl}-5-methyl-pyrido[2,3-d]pyrimidine-2,4-diamine::CHEMBL23705
SMILES COc1ccc(N(C)Cc2cnc3nc(N)nc(N)c3c2C)c(OC)c1
InChI Key InChIKey=RONZFRBULXXYSS-UHFFFAOYSA-N
Data  9 IC50
  Tab Delimited (TSV)   2D SDfile   Computed 3D by Vconf -m prep SDfile
Find this compound or compounds like it in BindingDB:
Activity Spreadsheet -- Enzyme Inhibition Constant Data from BindingDB
Found 9 hits for monomerid = 50034935
TargetBifunctional dihydrofolate reductase-thymidylate synthase(Toxoplasma gondii)
Duquesne University
Curated by ChEMBL
LigandPNGBDBM50034935(6-{[(2,4-Dimethoxy-phenyl)-methyl-amino]-methyl}-5...)
Affinity DataIC50:  38nM. Assay description: Inhibitory activity against Dihydrofolate reductase from Toxoplasma gondii
In DepthDetails ArticlePubMed
TargetDihydrofolate reductase(Pneumocystis carinii)
Duquesne University
Curated by ChEMBL
LigandPNGBDBM50034935(6-{[(2,4-Dimethoxy-phenyl)-methyl-amino]-methyl}-5...)
Affinity DataIC50:  510nM. Assay description: Inhibitory activity against Dihydrofolate reductase from Pneumocystis carinii
In DepthDetails ArticlePubMed
TargetDihydrofolate reductase(Rattus norvegicus (rat))
Duquesne University
Curated by ChEMBL
LigandPNGBDBM50034935(6-{[(2,4-Dimethoxy-phenyl)-methyl-amino]-methyl}-5...)
Affinity DataIC50:  330nM. Assay description: Inhibitory activity against Dihydrofolate reductase from rat liver
In DepthDetails ArticlePubMed
TargetBifunctional dihydrofolate reductase-thymidylate synthase(Toxoplasma gondii)
Duquesne University
Curated by ChEMBL
LigandPNGBDBM50034935(6-{[(2,4-Dimethoxy-phenyl)-methyl-amino]-methyl}-5...)
Affinity DataIC50:  53nM. Assay description: Inhibitory activity against Toxoplasma gondii dihydrofolate reductase
In DepthDetails ArticlePubMed
TargetDihydrofolate reductase(Pneumocystis carinii)
Duquesne University
Curated by ChEMBL
LigandPNGBDBM50034935(6-{[(2,4-Dimethoxy-phenyl)-methyl-amino]-methyl}-5...)
Affinity DataIC50:  510nM. Assay description: Inhibition of Pneumocystis carinii dihydrofolate reductase
In DepthDetails ArticlePubMed
TargetDihydrofolate reductase(Rattus norvegicus (rat))
Duquesne University
Curated by ChEMBL
LigandPNGBDBM50034935(6-{[(2,4-Dimethoxy-phenyl)-methyl-amino]-methyl}-5...)
Affinity DataIC50:  230nM. Assay description: Inhibitory activity of the compound against rat liver dihydrofolate reductase
In DepthDetails ArticlePubMed
TargetDihydrofolate reductase(Rattus norvegicus (rat))
Duquesne University
Curated by ChEMBL
LigandPNGBDBM50034935(6-{[(2,4-Dimethoxy-phenyl)-methyl-amino]-methyl}-5...)
Affinity DataIC50:  330nM. Assay description: Inhibition of rat liver dihydrofolate reductase
In DepthDetails ArticlePubMed
TargetBifunctional dihydrofolate reductase-thymidylate synthase(Toxoplasma gondii)
Duquesne University
Curated by ChEMBL
LigandPNGBDBM50034935(6-{[(2,4-Dimethoxy-phenyl)-methyl-amino]-methyl}-5...)
Affinity DataIC50:  38nM. Assay description: Inhibition of Toxoplasma gondii dihydrofolate reductase
In DepthDetails ArticlePubMed
TargetDihydrofolate reductase(Pneumocystis carinii)
Duquesne University
Curated by ChEMBL
LigandPNGBDBM50034935(6-{[(2,4-Dimethoxy-phenyl)-methyl-amino]-methyl}-5...)
Affinity DataIC50:  350nM. Assay description: Inhibitory activity against Pneumocystis carinii dihydrofolate reductase
In DepthDetails ArticlePubMed