BDBM50035002 CHEMBL299785::ethyl (4-chlorophenyl)sulfonyl[(ethoxycarbonyl)oxy]carbamate
SMILES CCOC(=O)ON(C(=O)OCC)S(=O)(=O)c1ccc(Cl)cc1
InChI Key InChIKey=OTHFWSFZVTTZEZ-UHFFFAOYSA-N
Data  1 IC50
  Tab Delimited (TSV)   2D SDfile   Computed 3D by Vconf -m prep SDfile
Find this compound or compounds like it in BindingDB:
Activity Spreadsheet -- Enzyme Inhibition Constant Data from BindingDB
Found 1 hit for monomerid = 50035002
TargetAldehyde dehydrogenase 1A1(Rattus norvegicus)
University Of Minnesota
Curated by ChEMBL
LigandPNGBDBM50035002(CHEMBL299785 | ethyl (4-chlorophenyl)sulfonyl[(eth...)
Affinity DataIC50:  2.40E+4nM. Assay description: In vitro inhibition against yeast Alcohol dehydrogenase
In DepthDetails ArticlePubMed