BDBM50036776 6,8-difluoro-1'-phenethylspiro[1,2,3,4-tetrahydronaphthalene-2,4'-(hexahydropyridine)]-1-one; fumarate::CHEMBL122165
SMILES Fc1cc(F)c2C(=O)C3(CCN(CCc4ccccc4)CC3)CCc2c1
InChI Key InChIKey=FBWUQEIVZSYNQZ-UHFFFAOYSA-N
Data  2 KI
  Tab Delimited (TSV)   2D SDfile   Computed 3D by Vconf -m prep SDfile
Find this compound or compounds like it in BindingDB:
Activity Spreadsheet -- Enzyme Inhibition Constant Data from BindingDB
Found 2 hits for monomerid = 50036776
TargetSigma non-opioid intracellular receptor 1(Homo sapiens (Human))
Dupont Pharmaceuticals
Curated by ChEMBL
LigandPNGBDBM50036776(6,8-difluoro-1'-phenethylspiro[1,2,3,4-tetrahydron...)
Affinity DataKi:  2nM. Assay description: Binding affinity for sigma receptor of guinea pig whole brain using [3H]-SKF- 100047 radioligand
In DepthDetails ArticlePubMed
TargetD(2) dopamine receptor(Homo sapiens (Human))
Dupont Pharmaceuticals
Curated by ChEMBL
LigandPNGBDBM50036776(6,8-difluoro-1'-phenethylspiro[1,2,3,4-tetrahydron...)
Affinity DataKi:  515nM. Assay description: Binding affinity for dopamine D2 receptor using [3H]spiperone in guinea pig striatum
In DepthDetails ArticlePubMed