BDBM50037949 (4-{2-[4-(methylsulfonyl)phenyl]cyclopent-1-en-1-yl}phenyl)methanol::CHEMBL109578::{4-[2-(4-Methanesulfonyl-phenyl)-cyclopent-1-enyl]-phenyl}-methanol
SMILES CS(=O)(=O)c1ccc(cc1)C1=C(CCC1)c1ccc(CO)cc1
InChI Key InChIKey=UJLUSLDRZONCSO-UHFFFAOYSA-N
Data  3 IC50
  Tab Delimited (TSV)   2D SDfile   Computed 3D by Vconf -m prep SDfile
Find this compound or compounds like it in BindingDB:
Activity Spreadsheet -- Enzyme Inhibition Constant Data from BindingDB
Found 3 hits for monomerid = 50037949
TargetProstaglandin G/H synthase 1(Homo sapiens (Human))
Searle Research & Development
Curated by ChEMBL
LigandPNGBDBM50037949((4-{2-[4-(methylsulfonyl)phenyl]cyclopent-1-en-1-y...)
Affinity DataIC50: >1.00E+5nM. Assay description: Tested for inhibition against Prostaglandin G/H synthase 1
In DepthDetails ArticlePubMed
TargetProstaglandin G/H synthase 2(Homo sapiens (Human))
Universit£
Curated by ChEMBL
LigandPNGBDBM50037949((4-{2-[4-(methylsulfonyl)phenyl]cyclopent-1-en-1-y...)
Affinity DataIC50:  3.24E+3nM. Assay description: Inhibition of human Prostaglandin G/H synthase 2
In DepthDetails ArticlePubMed
TargetProstaglandin G/H synthase 2(Homo sapiens (Human))
Universit£
Curated by ChEMBL
LigandPNGBDBM50037949((4-{2-[4-(methylsulfonyl)phenyl]cyclopent-1-en-1-y...)
Affinity DataIC50:  3.20E+3nM. Assay description: Tested for inhibition against Prostaglandin G/H synthase 2
In DepthDetails ArticlePubMed