BDBM50038417 (3R,4R)-3-Ethyl-4-phenyl-3-(3-phenyl-propyl)-1-(2,4,6-trimethoxy-phenyl)-azetidin-2-one::CHEMBL46092
SMILES CC[C@@]1(CCCc2ccccc2)[C@H](N(C1=O)c1c(OC)cc(OC)cc1OC)c1ccccc1
InChI Key InChIKey=DAYZPZNGHCSPDD-XRKRLSELSA-N
Data  1 IC50
  Tab Delimited (TSV)   2D SDfile   Computed 3D by Vconf -m prep SDfile
Find this compound or compounds like it in BindingDB:
Activity Spreadsheet -- Enzyme Inhibition Constant Data from BindingDB
Found 1 hit for monomerid = 50038417
TargetSterol O-acyltransferase 1(Rattus norvegicus)
Schering-Plough Research Institute
Curated by ChEMBL
LigandPNGBDBM50038417((3R,4R)-3-Ethyl-4-phenyl-3-(3-phenyl-propyl)-1-(2,...)
Affinity DataIC50:  1.20E+4nM. Assay description: Concentration required for 50% inhibition of Acyl coenzyme A:cholesterol acyltransferase activity using microsomal ACAT assay
In DepthDetails ArticlePubMed