BDBM50040646 1-[2-(1-Benzyl-piperidin-4-yl)-ethyl]-3-(4-methoxy-benzoyl)-thiourea::CHEMBL159474
SMILES COc1ccc(cc1)C(=O)NC(=S)NCCC1CCN(Cc2ccccc2)CC1
InChI Key InChIKey=GSSJNLLKDOAVFV-UHFFFAOYSA-N
Data  1 IC50
  Tab Delimited (TSV)   2D SDfile   Computed 3D by Vconf -m prep SDfile
Find this compound or compounds like it in BindingDB:
Activity Spreadsheet -- Enzyme Inhibition Constant Data from BindingDB
Found 1 hit for monomerid = 50040646
TargetAcetylcholinesterase(Rattus norvegicus (rat))
Centre De Recherche Pierre Fabre MéDicament
Curated by ChEMBL
LigandPNGBDBM50040646(1-[2-(1-Benzyl-piperidin-4-yl)-ethyl]-3-(4-methoxy...)
Affinity DataIC50:  10nM. Assay description: Inhibition against acetylcholinesterase (AChE)
In DepthDetails ArticlePubMed