BDBM50041271 ((S)-1-Methyl-2-phenyl-ethyl)-(4-phenyl-butyl)-amine::CHEMBL20976
SMILES C[C@@H](Cc1ccccc1)NCCCCc1ccccc1
InChI Key InChIKey=LFAVXHNZCYGUPI-KRWDZBQOSA-N
Data  2 KI
  Tab Delimited (TSV)   2D SDfile   Computed 3D by Vconf -m prep SDfile
Find this compound or compounds like it in BindingDB:
Activity Spreadsheet -- Enzyme Inhibition Constant Data from BindingDB
Found 2 hits for monomerid = 50041271
TargetSigma non-opioid intracellular receptor 1(Homo sapiens (Human))
Virginia Commonwealth University
Curated by ChEMBL
LigandPNGBDBM50041271(((S)-1-Methyl-2-phenyl-ethyl)-(4-phenyl-butyl)-ami...)
Affinity DataKi:  6.60nM. Assay description: Binding affinity towards sigma opioid receptor in guinea pig cerebral homogenate using [3H]DTG as radioligand
In DepthDetails ArticlePubMed
TargetSigma non-opioid intracellular receptor 1(Homo sapiens (Human))
Virginia Commonwealth University
Curated by ChEMBL
LigandPNGBDBM50041271(((S)-1-Methyl-2-phenyl-ethyl)-(4-phenyl-butyl)-ami...)
Affinity DataKi:  7.40nM. Assay description: Binding affinity against sigma-1 receptor of guinea pig brain membranes using [3H]-pentazocine as radioligand
In DepthDetails ArticlePubMed