BDBM50042075 1-(1-Phenyl-cyclopentylmethyl)-3-(2,4,6-trimethoxy-phenyl)-urea::CHEMBL323852
SMILES COc1cc(OC)c(NC(=O)NCC2(CCCC2)c2ccccc2)c(OC)c1
InChI Key InChIKey=QSMTUEZSJKWWRO-UHFFFAOYSA-N
Data  1 IC50
  Tab Delimited (TSV)   2D SDfile   Computed 3D by Vconf -m prep SDfile
Find this compound or compounds like it in BindingDB:
Activity Spreadsheet -- Enzyme Inhibition Constant Data from BindingDB
Found 1 hit for monomerid = 50042075
TargetAcyl-CoA:cholesterol acyltransferase(Oryctolagus cuniculus)
Warner-Lambert
Curated by ChEMBL
LigandPNGBDBM50042075(1-(1-Phenyl-cyclopentylmethyl)-3-(2,4,6-trimethoxy...)
Affinity DataIC50:  1.40E+3nM. Assay description: In vitro inhibition of Acyl coenzyme A:cholesterol acyltransferase using intestinal microsomes isolated from cholesterol fed rabbits
In DepthDetails ArticlePubMed