BDBM50042099 1-(2,5-Dimethyl-phenyl)-3-(1-phenyl-cyclohexylmethyl)-urea::CHEMBL112738
SMILES Cc1ccc(C)c(NC(=O)NCC2(CCCCC2)c2ccccc2)c1
InChI Key InChIKey=WCSZVPSEKUGUES-UHFFFAOYSA-N
Data  1 IC50
  Tab Delimited (TSV)   2D SDfile   Computed 3D by Vconf -m prep SDfile
Find this compound or compounds like it in BindingDB:
Activity Spreadsheet -- Enzyme Inhibition Constant Data from BindingDB
Found 1 hit for monomerid = 50042099
TargetAcyl-CoA:cholesterol acyltransferase(Oryctolagus cuniculus)
Warner-Lambert
Curated by ChEMBL
LigandPNGBDBM50042099(1-(2,5-Dimethyl-phenyl)-3-(1-phenyl-cyclohexylmeth...)
Affinity DataIC50:  470nM. Assay description: In vitro inhibition of Acyl coenzyme A:cholesterol acyltransferase using intestinal microsomes isolated from cholesterol fed rabbits
In DepthDetails ArticlePubMed