BDBM50043028 2-Diphenylacetyl-5-methyl-1,2,3,4-tetrahydro-isoquinoline-3-carboxylic acid::CHEMBL128065
SMILES Cc1cccc2CN(C(Cc12)C(O)=O)C(=O)C(c1ccccc1)c1ccccc1
InChI Key InChIKey=VNRNPNJJEINOAI-UHFFFAOYSA-N
Data  2 IC50
  Tab Delimited (TSV)   2D SDfile   Computed 3D by Vconf -m prep SDfile
Find this compound or compounds like it in BindingDB:
Activity Spreadsheet -- Enzyme Inhibition Constant Data from BindingDB
Found 2 hits for monomerid = 50043028
TargetType-1 angiotensin II receptor A/B(RAT)
Dupont Pharmaceuticals
Curated by ChEMBL
LigandPNGBDBM50043028(2-Diphenylacetyl-5-methyl-1,2,3,4-tetrahydro-isoqu...)
Affinity DataIC50: >1.00E+4nM. Assay description: Binding affinity towards Angiotensin II receptor, type 1 in rat isolated adrenal cortical microsomes
In DepthDetails ArticlePubMed
TargetType-2 angiotensin II receptor(RAT)
Dupont Pharmaceuticals
Curated by ChEMBL
LigandPNGBDBM50043028(2-Diphenylacetyl-5-methyl-1,2,3,4-tetrahydro-isoqu...)
Affinity DataIC50:  300nM. Assay description: Binding affinity towards Angiotensin II receptor, type 2 in rat isolated adrenal medullary microsomes
In DepthDetails ArticlePubMed