BDBM50043600 1N-(2-amino-1-phenylcarbamoylethyl)-2-[1-amino-(1R)-ethylcarboxamido]-4-phenyl-(2S)-butanamide::CHEMBL2370821
SMILES C[C@@H](N)C(=O)N[C@@H](CCc1ccccc1)C(=O)N[C@@H](CN)C(=O)Nc1ccccc1
InChI Key InChIKey=GGFSYPJCMRNMQX-MNEFBYGVSA-N
Data  2 KI
  Tab Delimited (TSV)   2D SDfile   Computed 3D by Vconf -m prep SDfile
Find this compound or compounds like it in BindingDB:
Activity Spreadsheet -- Enzyme Inhibition Constant Data from BindingDB
Found 2 hits for monomerid = 50043600
TargetInterstitial collagenase(Homo sapiens (Human))
Merck Research Laboratories
Curated by ChEMBL
LigandPNGBDBM50043600(1N-(2-amino-1-phenylcarbamoylethyl)-2-[1-amino-(1R...)
Affinity DataKi:  3.18E+3nM. Assay description: Inhibition of human fibroblast collagenase
In DepthDetails ArticlePubMed
TargetStromelysin-1(Homo sapiens (Human))
Merck Research Laboratories
Curated by ChEMBL
LigandPNGBDBM50043600(1N-(2-amino-1-phenylcarbamoylethyl)-2-[1-amino-(1R...)
Affinity DataKi: >1.00E+4nM. Assay description: Inhibition of human fibroblast stromelysin
In DepthDetails ArticlePubMed