BDBM50044045 CHEMBL107922::[2-({2-[(2-{[2-(3,4-Dichloro-phenyl)-ethyl]-methyl-amino}-ethyl)-methyl-amino]-ethyl}-methyl-amino)-ethyl]-methyl-(2-pyrrolidin-1-yl-ethyl)-amine
SMILES CN(CCN(C)CCN(C)CCc1ccc(Cl)c(Cl)c1)CCN(C)CCN1CCCC1
InChI Key InChIKey=PLIJZOIPUXTBOX-UHFFFAOYSA-N
Data  1 KI
  Tab Delimited (TSV)   2D SDfile   Computed 3D by Vconf -m prep SDfile
Find this compound or compounds like it in BindingDB:
Activity Spreadsheet -- Enzyme Inhibition Constant Data from BindingDB
Found 1 hit for monomerid = 50044045
TargetSigma non-opioid intracellular receptor 1(Homo sapiens (Human))
National Institutes Of Diabetes And Digestive And Kidney Diseases
Curated by ChEMBL
LigandPNGBDBM50044045(CHEMBL107922 | [2-({2-[(2-{[2-(3,4-Dichloro-phenyl...)
Affinity DataKi:  227nM. Assay description: Binding affinity towards sigma 1 receptor was determined in guinea pig brain membrane using [3H](+)-pentazocine as radioligand
In DepthDetails ArticlePubMed