BDBM50047769 2-{[Acetyl-(4-tetradecyloxy-benzoyl)-amino]-methyl}-1-methyl-pyridinium; iodide::CHEMBL154205
SMILES CCCCCCCCCCCCCCOc1ccc(cc1)C(=O)N(Cc1cccc[n+]1C)C(C)=O
InChI Key InChIKey=UAFNJVZVJIQIAS-UHFFFAOYSA-N
Data  1 IC50
  Tab Delimited (TSV)   2D SDfile   Computed 3D by Vconf -m prep SDfile
Find this compound or compounds like it in BindingDB:
Activity Spreadsheet -- Enzyme Inhibition Constant Data from BindingDB
Found 1 hit for monomerid = 50047769
TargetPlatelet-activating factor receptor(Cavia porcellus)
American Cyanamid
Curated by ChEMBL
LigandPNGBDBM50047769(2-{[Acetyl-(4-tetradecyloxy-benzoyl)-amino]-methyl...)
Affinity DataIC50:  950nM. Assay description: Inhibition of PAF-induced platelet aggregation in rabbit platelet rich plasma
In DepthDetails ArticlePubMed