BDBM50047780 1-Methyl-2-[(4-tetradecyloxy-benzoylamino)-methyl]-pyridinium; iodide::CHEMBL154993
SMILES CCCCCCCCCCCCCCOc1ccc(cc1)C(=O)NCc1cccc[n+]1C
InChI Key InChIKey=LKYIIADCSRTDCM-UHFFFAOYSA-O
Data  1 IC50
  Tab Delimited (TSV)   2D SDfile   Computed 3D by Vconf -m prep SDfile
Find this compound or compounds like it in BindingDB:
Activity Spreadsheet -- Enzyme Inhibition Constant Data from BindingDB
Found 1 hit for monomerid = 50047780
TargetPlatelet-activating factor receptor(Cavia porcellus)
American Cyanamid
Curated by ChEMBL
LigandPNGBDBM50047780(1-Methyl-2-[(4-tetradecyloxy-benzoylamino)-methyl]...)
Affinity DataIC50: >1.00E+4nM. Assay description: Inhibition of PAF-induced platelet aggregation in rabbit platelet rich plasma
In DepthDetails ArticlePubMed