BDBM50047892 4-Hydroxy-2-oxo-1-phenyl-1,2-dihydro-[1,8]naphthyridine-3-carboxylic acid 8-methyl-8-aza-bicyclo[3.2.1]oct-3-yl ester::CHEMBL156176
SMILES CN1C2CCC1CC(C2)OC(=O)c1c(O)c2cccnc2n(-c2ccccc2)c1=O
InChI Key InChIKey=UGHLNPUUSKCODF-UHFFFAOYSA-N
Data  1 KI
  Tab Delimited (TSV)   2D SDfile   Computed 3D by Vconf -m prep SDfile
Find this compound or compounds like it in BindingDB:
Activity Spreadsheet -- Enzyme Inhibition Constant Data from BindingDB
Found 1 hit for monomerid = 50047892
Target5-hydroxytryptamine receptor 3A/3B(Rattus norvegicus)
Kyowa Hakko Kogyo
Curated by ChEMBL
LigandPNGBDBM50047892(4-Hydroxy-2-oxo-1-phenyl-1,2-dihydro-[1,8]naphthyr...)
Affinity DataKi: >100nM. Assay description: Binding affinity against radioligand [3H]quipazine labeled 5-hydroxytryptamine 3 receptor sites in neuroblastoma-glioma (NG108-15) cells.
In DepthDetails ArticlePubMed