BDBM50049596 6-(4-Methoxy-phenylsulfanylmethyl)-5-methyl-pyrido[2,3-d]pyrimidine-2,4-diamine::CHEMBL23911
SMILES COc1ccc(SCc2cnc3nc(N)nc(N)c3c2C)cc1
InChI Key InChIKey=YYBYCBOPPNOBID-UHFFFAOYSA-N
Data  6 IC50
  Tab Delimited (TSV)   2D SDfile   Computed 3D by Vconf -m prep SDfile
Find this compound or compounds like it in BindingDB:
Activity Spreadsheet -- Enzyme Inhibition Constant Data from BindingDB
Found 6 hits for monomerid = 50049596
TargetBifunctional dihydrofolate reductase-thymidylate synthase(Toxoplasma gondii)
Southern Research Institute
Curated by ChEMBL
LigandPNGBDBM50049596(6-(4-Methoxy-phenylsulfanylmethyl)-5-methyl-pyrido...)
Affinity DataIC50:  63nM. Assay description: Inhibitory activity against Toxoplasma gondii dihydrofolate reductase
In DepthDetails ArticlePubMed
TargetDihydrofolate reductase(Pneumocystis carinii)
Southern Research Institute
Curated by ChEMBL
LigandPNGBDBM50049596(6-(4-Methoxy-phenylsulfanylmethyl)-5-methyl-pyrido...)
Affinity DataIC50:  560nM. Assay description: Inhibitory activity against Pneumocystis carinii dihydrofolate reductase
In DepthDetails ArticlePubMed
TargetBifunctional dihydrofolate reductase-thymidylate synthase(Toxoplasma gondii)
Southern Research Institute
Curated by ChEMBL
LigandPNGBDBM50049596(6-(4-Methoxy-phenylsulfanylmethyl)-5-methyl-pyrido...)
Affinity DataIC50:  63nM. Assay description: Inhibitory activity against Toxoplasma gondii dihydrofolate reductase.
In DepthDetails ArticlePubMed
TargetDihydrofolate reductase(Rattus norvegicus (rat))
Southern Research Institute
Curated by ChEMBL
LigandPNGBDBM50049596(6-(4-Methoxy-phenylsulfanylmethyl)-5-methyl-pyrido...)
Affinity DataIC50:  520nM. Assay description: Inhibitory activity of the compound against rat liver dihydrofolate reductase
In DepthDetails ArticlePubMed
TargetDihydrofolate reductase(Saccharomyces cerevisiae)
Duquesne University
Curated by ChEMBL
LigandPNGBDBM50049596(6-(4-Methoxy-phenylsulfanylmethyl)-5-methyl-pyrido...)
Affinity DataIC50:  560nM. Assay description: Inhibitory activity against Pneumocystis carinii dihydrofolate reductase.
In DepthDetails ArticlePubMed
TargetDihydrofolate reductase(Rattus norvegicus (rat))
Southern Research Institute
Curated by ChEMBL
LigandPNGBDBM50049596(6-(4-Methoxy-phenylsulfanylmethyl)-5-methyl-pyrido...)
Affinity DataIC50:  520nM. Assay description: Inhibitory activity against rat liver dihydrofolate reductase.
In DepthDetails ArticlePubMed