BDBM50050216 CHEMBL24943::Dodecyl[[2,6-Bis(1-methylethyl)phenoxy]sulfonyl]carbamate
SMILES CCCCCCCCCCCCOC(=O)NS(=O)(=O)Oc1c(cccc1C(C)C)C(C)C
InChI Key InChIKey=LGADWTCPZGRHMW-UHFFFAOYSA-N
Data  1 IC50
  Tab Delimited (TSV)   2D SDfile   Computed 3D by Vconf -m prep SDfile
Find this compound or compounds like it in BindingDB:
Activity Spreadsheet -- Enzyme Inhibition Constant Data from BindingDB
Found 1 hit for monomerid = 50050216
TargetSterol O-acyltransferase 1(Rattus norvegicus)
Warner-Lambert
Curated by ChEMBL
LigandPNGBDBM50050216(CHEMBL24943 | Dodecyl[[2,6-Bis(1-methylethyl)pheno...)
Affinity DataIC50:  1.30E+4nM. Assay description: In vitro inhibitory activity against acyl coenzyme A:cholesterol acyltransferase 1 in microsomes of rat liver
In DepthDetails ArticlePubMed