BDBM50050225 (1R,5R)-2-isopropyl-5-methylcyclohexyl carbamate 2,6-diisopropylphenyl sulfonate::CHEMBL24992
SMILES CC(C)C1CC[C@@H](C)C[C@H]1OC(=O)NS(=O)(=O)Oc1c(cccc1C(C)C)C(C)C
InChI Key InChIKey=YKLKWVPILPSFGW-IIAQOEISSA-N
Data  1 IC50
  Tab Delimited (TSV)   2D SDfile   Computed 3D by Vconf -m prep SDfile
Find this compound or compounds like it in BindingDB:
Activity Spreadsheet -- Enzyme Inhibition Constant Data from BindingDB
Found 1 hit for monomerid = 50050225
TargetSterol O-acyltransferase 1(Rattus norvegicus)
Warner-Lambert
Curated by ChEMBL
LigandPNGBDBM50050225((1R,5R)-2-isopropyl-5-methylcyclohexyl carbamate 2...)
Affinity DataIC50:  2.10E+4nM. Assay description: In vitro inhibitory activity against acyl coenzyme A:cholesterol acyltransferase 1 in microsomes of rat liver
In DepthDetails ArticlePubMed