BDBM50050226 (Adamantan-1yl)[[2,6-Bis(1-methylethyl)phenoxy]sulfonyl]carbamate::CHEMBL22836
SMILES CC(C)c1cccc(C(C)C)c1OS(=O)(=O)NC(=O)OC12CC3CC(CC(C3)C1)C2
InChI Key InChIKey=MPEICCGRJUGTHS-UHFFFAOYSA-N
Data  1 IC50
  Tab Delimited (TSV)   2D SDfile   Computed 3D by Vconf -m prep SDfile
Find this compound or compounds like it in BindingDB:
Activity Spreadsheet -- Enzyme Inhibition Constant Data from BindingDB
Found 1 hit for monomerid = 50050226
TargetSterol O-acyltransferase 1(Rattus norvegicus)
Warner-Lambert
Curated by ChEMBL
LigandPNGBDBM50050226((Adamantan-1yl)[[2,6-Bis(1-methylethyl)phenoxy]sul...)
Affinity DataIC50:  1.30E+4nM. Assay description: In vitro inhibitory activity against acyl coenzyme A:cholesterol acyltransferase 1 in microsomes of rat liver
In DepthDetails ArticlePubMed