BDBM50050241 2,6-Bis(1-methylethyl)phenyl[[(hexadecyl)-oxy]sulfonyl]carbamate::CHEMBL22153
SMILES CCCCCCCCCCCCCCCCOS(=O)(=O)NC(=O)Oc1c(cccc1C(C)C)C(C)C
InChI Key InChIKey=HCIKYXBMEJAUEU-UHFFFAOYSA-N
Data  1 IC50
  Tab Delimited (TSV)   2D SDfile   Computed 3D by Vconf -m prep SDfile
Find this compound or compounds like it in BindingDB:
Activity Spreadsheet -- Enzyme Inhibition Constant Data from BindingDB
Found 1 hit for monomerid = 50050241
TargetSterol O-acyltransferase 1(Rattus norvegicus)
Warner-Lambert
Curated by ChEMBL
LigandPNGBDBM50050241(2,6-Bis(1-methylethyl)phenyl[[(hexadecyl)-oxy]sulf...)
Affinity DataIC50:  1.03E+4nM. Assay description: In vitro inhibitory activity against acyl coenzyme A:cholesterol acyltransferase 1 in microsomes of rat liver
In DepthDetails ArticlePubMed