BDBM50050254 CHEMBL22296::[2,6-Bis(1-methylethyl)-4-fluoro]phenyl[[2,6-Bis(1-methylethyl)phenoxy]sulfonyl]carbamate
SMILES CC(C)c1cccc(C(C)C)c1OS(=O)(=O)NC(=O)Oc1c(cc(F)cc1C(C)C)C(C)C
InChI Key InChIKey=FNVYNCGHIQVLMO-UHFFFAOYSA-N
Data  1 IC50
  Tab Delimited (TSV)   2D SDfile   Computed 3D by Vconf -m prep SDfile
Find this compound or compounds like it in BindingDB:
Activity Spreadsheet -- Enzyme Inhibition Constant Data from BindingDB
Found 1 hit for monomerid = 50050254
TargetSterol O-acyltransferase 1(Rattus norvegicus)
Warner-Lambert
Curated by ChEMBL
LigandPNGBDBM50050254(CHEMBL22296 | [2,6-Bis(1-methylethyl)-4-fluoro]phe...)
Affinity DataIC50: >5.00E+4nM. Assay description: In vitro inhibitory activity against acyl coenzyme A:cholesterol acyltransferase 1 in microsomes of rat liver
In DepthDetails ArticlePubMed