BDBM50050286 2,6-Bis(1-methylethyl)phenyl[[2,6-dimethylethyl-4-hrdroxy)phenoxy]sulfonyl]carbamate::CHEMBL25216
SMILES CC(C)c1cccc(C(C)C)c1OC(=O)NS(=O)(=O)Oc1c(cc(O)cc1C(C)C)C(C)C
InChI Key InChIKey=PYMHVKIHFBNRCC-UHFFFAOYSA-N
Data  1 IC50
  Tab Delimited (TSV)   2D SDfile   Computed 3D by Vconf -m prep SDfile
Find this compound or compounds like it in BindingDB:
Activity Spreadsheet -- Enzyme Inhibition Constant Data from BindingDB
Found 1 hit for monomerid = 50050286
TargetSterol O-acyltransferase 1(Rattus norvegicus)
Warner-Lambert
Curated by ChEMBL
LigandPNGBDBM50050286(2,6-Bis(1-methylethyl)phenyl[[2,6-dimethylethyl-4-...)
Affinity DataIC50: >5.00E+4nM. Assay description: In vitro inhibitory activity against acyl coenzyme A:cholesterol acyltransferase 1 in microsomes of rat liver
In DepthDetails ArticlePubMed