BDBM50050323 1-methylheptyl[[2,6-Bis(1-methylethyl)phenoxy]sulfonyl]carbamate::CHEMBL22409
SMILES CCCCCCC(C)OC(=O)NS(=O)(=O)Oc1c(cccc1C(C)C)C(C)C
InChI Key InChIKey=MQUTYJCAQZHNQY-UHFFFAOYSA-N
Data  1 IC50
  Tab Delimited (TSV)   2D SDfile   Computed 3D by Vconf -m prep SDfile
Find this compound or compounds like it in BindingDB:
Activity Spreadsheet -- Enzyme Inhibition Constant Data from BindingDB
Found 1 hit for monomerid = 50050323
TargetSterol O-acyltransferase 1(Rattus norvegicus)
Warner-Lambert
Curated by ChEMBL
LigandPNGBDBM50050323(1-methylheptyl[[2,6-Bis(1-methylethyl)phenoxy]sulf...)
Affinity DataIC50:  2.60E+4nM. Assay description: In vitro inhibitory activity against acyl coenzyme A:cholesterol acyltransferase 1 in microsomes of rat liver
In DepthDetails ArticlePubMed