BDBM50050332 2,4,6-Tri(1-methylisopropyl)phenyl[[2,6-Bis(1-methylethyl)phenoxy]sulfonyl]carbamate::CHEMBL282938
SMILES CC(C)c1cccc(C(C)C)c1OS(=O)(=O)NC(=O)Oc1c(cc(cc1C(C)(C)C)C(C)(C)C)C(C)(C)C
InChI Key InChIKey=XHUPSFNBCGDXBC-UHFFFAOYSA-N
Data  1 IC50
  Tab Delimited (TSV)   2D SDfile   Computed 3D by Vconf -m prep SDfile
Find this compound or compounds like it in BindingDB:
Activity Spreadsheet -- Enzyme Inhibition Constant Data from BindingDB
Found 1 hit for monomerid = 50050332
TargetSterol O-acyltransferase 1(Rattus norvegicus)
Warner-Lambert
Curated by ChEMBL
LigandPNGBDBM50050332(2,4,6-Tri(1-methylisopropyl)phenyl[[2,6-Bis(1-meth...)
Affinity DataIC50:  2.60E+4nM. Assay description: In vitro inhibitory activity against acyl coenzyme A:cholesterol acyltransferase 1 in microsomes of rat liver
In DepthDetails ArticlePubMed