BDBM50050524 Boronic acid derivative::CHEMBL291428
SMILES N[C@H](C(=O)N1CCC[C@H]1B(O)O)c1ccccc1
InChI Key InChIKey=JCKSFPAAENVYOQ-QWRGUYRKSA-N
Data  1 IC50
  Tab Delimited (TSV)   2D SDfile   Computed 3D by Vconf -m prep SDfile
Find this compound or compounds like it in BindingDB:
Activity Spreadsheet -- Enzyme Inhibition Constant Data from BindingDB
Found 1 hit for monomerid = 50050524
TargetDipeptidyl peptidase 4(Homo sapiens (Human))
Boehringer Ingelheim Pharmaceuticals
Curated by ChEMBL
LigandPNGBDBM50050524(Boronic acid derivative | CHEMBL291428)
Affinity DataIC50:  63nM. Assay description: In vitro for inhibition of Dipeptidylpeptidase IV.
In DepthDetails ArticlePubMed