BDBM50053295 CHEMBL125751::{4-[2-(1H-Imidazol-4-yl)-ethoxy]-phenyl}-phenyl-methanone
SMILES O=C(c1ccccc1)c1ccc(OCCc2cnc[nH]2)cc1
InChI Key InChIKey=AERFRISBAZTIHN-UHFFFAOYSA-N
Data  1 KI
  Tab Delimited (TSV)   2D SDfile   Computed 3D by Vconf -m prep SDfile
Find this compound or compounds like it in BindingDB:
Activity Spreadsheet -- Enzyme Inhibition Constant Data from BindingDB
Found 1 hit for monomerid = 50053295
TargetHistamine H3 receptor(Rattus norvegicus (rat))
University College London
Curated by ChEMBL
LigandPNGBDBM50053295(CHEMBL125751 | {4-[2-(1H-Imidazol-4-yl)-ethoxy]-ph...)
Affinity DataKi:  54nM. Assay description: Rat Histamine H3 receptor antagonism determined by [K+] - evoked depolarization-induced release of [3H]-histamine from rat cerebral cortex synaptosom...
In DepthDetails ArticlePubMed