BDBM50054189 (10R,13S)-17-Acetyl-10,13-dimethyl-1,2,6,7,8,9,10,11,12,13,14,15-dodecahydro-cyclopenta[a]phenanthren-3-one::CHEMBL422998
SMILES CC(=O)C1=CCC2C3CCC4=CC(=O)CC[C@]4(C)C3CC[C@]12C
InChI Key InChIKey=VRRHHTISESGZFN-TYKSMWHLSA-N
Data  2 IC50
  Tab Delimited (TSV)   2D SDfile   Computed 3D by Vconf -m prep SDfile
Find this compound or compounds like it in BindingDB:
Activity Spreadsheet -- Enzyme Inhibition Constant Data from BindingDB
Found 2 hits for monomerid = 50054189
TargetSteroid 17-alpha-hydroxylase/17,20 lyase(Homo sapiens (Human))
University Of Maryland
Curated by ChEMBL
LigandPNGBDBM50054189((10R,13S)-17-Acetyl-10,13-dimethyl-1,2,6,7,8,9,10,...)
Affinity DataIC50:  1.77E+3nM. Assay description: Inhibition of human testicular steroid 17-alpha-hydroxylase
In DepthDetails ArticlePubMed
TargetSteroid 17-alpha-hydroxylase/17,20 lyase(Homo sapiens (Human))
University Of Maryland
Curated by ChEMBL
LigandPNGBDBM50054189((10R,13S)-17-Acetyl-10,13-dimethyl-1,2,6,7,8,9,10,...)
Affinity DataIC50:  1.77E+3nM. Assay description: Inhibition of human testicular steroid 17-alpha-hydroxylase
In DepthDetails ArticlePubMed