BDBM50054266 CHEMBL3319385::US9522881, 11c-3 (L88M50)
SMILES Cn1c(c(I)c2cc(C(O)=O)c(O)cc12)-c1cccc(NC(=O)CCC(=O)Nc2ccc(OCc3ccccc3)c(Cl)c2)c1
InChI Key InChIKey=ZNDZBTZKCRWRAY-UHFFFAOYSA-N
Data  2 IC50
  Tab Delimited (TSV)   2D SDfile   Computed 3D by Vconf -m prep SDfile
Find this compound or compounds like it in BindingDB:
Activity Spreadsheet -- Enzyme Inhibition Constant Data from BindingDB
Found 2 hits for monomerid = 50054266
TargetTyrosine-protein phosphatase non-receptor type 11(Homo sapiens (Human))
Indiana University School Of Medicine
Curated by ChEMBL
LigandPNGBDBM50054266(CHEMBL3319385 | US9522881, 11c-3 (L88M50))
Affinity DataIC50:  5.00E+3nM. Assay description: Inhibition of SHP2 (unknown origin) using p-nitrophenyl phosphate substrate by microplate spectrophotometry
In DepthDetails ArticlePubMed
TargetPhosphatidylinositol 3,4,5-trisphosphate 5-phosphatase 2(Homo sapiens (Human))
Indiana University Research and Technology
US Patent
LigandPNGBDBM50054266(CHEMBL3319385 | US9522881, 11c-3 (L88M50))
Affinity DataIC50:  5.00E+3nMpH: 7.0Assay Description:The inhibition assays were performed at 25° C. in 50 mM 3,3-dimethylglutarate buffer, pH 7.0, containing 1 mM EDTA with an ionic strength of 0.15M ad...
In DepthDetails US Patent