BDBM50054617 9-Hydroxy-8-(1-phenyl-allyl)-6-oxa-spiro[4.5]dec-8-en-7-one::CHEMBL356524
SMILES C=CC(C1C(=O)CC2(CCCC2)OC1=O)c1ccccc1
InChI Key InChIKey=XOYHXRXUIIUSDD-UHFFFAOYSA-N
Data  1 IC50
  Tab Delimited (TSV)   2D SDfile   Computed 3D by Vconf -m prep SDfile
Find this compound or compounds like it in BindingDB:
Activity Spreadsheet -- Enzyme Inhibition Constant Data from BindingDB
Found 1 hit for monomerid = 50054617
TargetGag-Pol polyprotein [489-587](Human immunodeficiency virus type 1)
Pharmacia & Upjohn
Curated by ChEMBL
LigandPNGBDBM50054617(9-Hydroxy-8-(1-phenyl-allyl)-6-oxa-spiro[4.5]dec-8...)
Affinity DataIC50:  3.00E+3nM. Assay description: HIV Protease inhibitory activity
In DepthDetails ArticlePubMed