BDBM50055115 1-(6-(benzyloxy)-1,2,3,4-tetrahydronaphthalen-1-yl)-1-hydroxyurea::CHEMBL146240::N-Hydroxy-N-[1,2,3,4-tetrahydro-6-(benzyloxy)-1-naphthalenyl]urea
SMILES NC(=O)N(O)C1CCCc2cc(OCc3ccccc3)ccc12
InChI Key InChIKey=HGXVXGSOOPCMHM-UHFFFAOYSA-N
Data  2 IC50
  Tab Delimited (TSV)   2D SDfile   Computed 3D by Vconf -m prep SDfile
Find this compound or compounds like it in BindingDB:
Activity Spreadsheet -- Enzyme Inhibition Constant Data from BindingDB
Found 2 hits for monomerid = 50055115
TargetPolyunsaturated fatty acid 5-lipoxygenase(Rattus norvegicus)
Smithkline Beecham Pharmaceuticals
Curated by ChEMBL
LigandPNGBDBM50055115(1-(6-(benzyloxy)-1,2,3,4-tetrahydronaphthalen-1-yl...)
Affinity DataIC50:  1.30E+3nM. Assay description: Inhibitory activity against rat 5-lipoxygenase by using continuous oxygen consumption assay.
In DepthDetails ArticlePubMed
TargetPolyunsaturated fatty acid 5-lipoxygenase(Rattus norvegicus)
Smithkline Beecham Pharmaceuticals
Curated by ChEMBL
LigandPNGBDBM50055115(1-(6-(benzyloxy)-1,2,3,4-tetrahydronaphthalen-1-yl...)
Affinity DataIC50:  1.30E+3nM. Assay description: Inhibitory activity against rat 5-lipoxygenase by using continuous oxygen consumption assay.
In DepthDetails ArticlePubMed