BDBM50055389 (3-Aminooxalyl-1-benzoyl-2-ethyl-1H-indol-4-yloxy)-acetic acid::CHEMBL347052
SMILES CCc1c(C(=O)C(N)=O)c2c(OCC(O)=O)cccc2n1C(=O)c1ccccc1
InChI Key InChIKey=JMDSAENGCRNKCV-UHFFFAOYSA-N
Data  2 IC50
  Tab Delimited (TSV)   2D SDfile   Computed 3D by Vconf -m prep SDfile
Find this compound or compounds like it in BindingDB:
Activity Spreadsheet -- Enzyme Inhibition Constant Data from BindingDB
Found 2 hits for monomerid = 50055389
TargetPhospholipase A2, membrane associated(Homo sapiens (Human))
Eli Lilly
Curated by ChEMBL
LigandPNGBDBM50055389((3-Aminooxalyl-1-benzoyl-2-ethyl-1H-indol-4-yloxy)...)
Affinity DataIC50:  39nM. Assay description: Inhibition of human nonpancreatic secretory Phospholipase A2 through DOC/PC assay
In DepthDetails ArticlePubMed
TargetPhospholipase A2, membrane associated(Homo sapiens (Human))
Eli Lilly
Curated by ChEMBL
LigandPNGBDBM50055389((3-Aminooxalyl-1-benzoyl-2-ethyl-1H-indol-4-yloxy)...)
Affinity DataIC50:  81nM. Assay description: Inhibition of human nonpancreatic secretory Phospholipase A2 through chromogenic assay
In DepthDetails ArticlePubMed