BDBM50057411 CHEMBL3326430
SMILES Cc1ccn(O)c(=S)c1
InChI Key InChIKey=RCWJCTXRXJZSQK-UHFFFAOYSA-N
Data  1 KI
PDB links: 1 PDB ID matches this monomer.
  Tab Delimited (TSV)   2D SDfile   Computed 3D by Vconf -m prep SDfile
Find this compound or compounds like it in BindingDB:
Activity Spreadsheet -- Enzyme Inhibition Constant Data from BindingDB
Found 1 hit for monomerid = 50057411
TargetCarbonic anhydrase 2(Homo sapiens (Human))
University Of California
Curated by ChEMBL
LigandPNGBDBM50057411(CHEMBL3326430)
Affinity DataKi:  3.80E+4nM. Assay description: Inhibition of human carbonic anhydrase using p-nitrophenylacetate as substrate preincubated for 10 mins before substrate addition by spectrophotometr...