BDBM50057417 CHEMBL3326436
SMILES On1cc(ccc1=S)C(F)(F)F
InChI Key InChIKey=CWWMSAVJLUCBNA-UHFFFAOYSA-N
Data  1 KI
PDB links: 1 PDB ID matches this monomer.
  Tab Delimited (TSV)   2D SDfile   Computed 3D by Vconf -m prep SDfile
Find this compound or compounds like it in BindingDB:
Activity Spreadsheet -- Enzyme Inhibition Constant Data from BindingDB
Found 1 hit for monomerid = 50057417
TargetCarbonic anhydrase 2(Homo sapiens (Human))
University Of California
Curated by ChEMBL
LigandPNGBDBM50057417(CHEMBL3326436)
Affinity DataKi:  2.70E+5nM. Assay description: Inhibition of human carbonic anhydrase using p-nitrophenylacetate as substrate preincubated for 10 mins before substrate addition by spectrophotometr...