BDBM50058565 CHEMBL59298::N-(cyclohexylmethyl)-N-hydroxyurea
SMILES NC(=O)N(O)CC1CCCCC1
InChI Key InChIKey=JNDZVVCAAGXHBY-UHFFFAOYSA-N
Data  2 IC50
  Tab Delimited (TSV)   2D SDfile   Computed 3D by Vconf -m prep SDfile
Find this compound or compounds like it in BindingDB:
Activity Spreadsheet -- Enzyme Inhibition Constant Data from BindingDB
Found 2 hits for monomerid = 50058565
TargetPolyunsaturated fatty acid 5-lipoxygenase(Rattus norvegicus)
Abbott Laboratories
Curated by ChEMBL
LigandPNGBDBM50058565(CHEMBL59298 | N-(cyclohexylmethyl)-N-hydroxyurea)
Affinity DataIC50:  5.70E+3nM. Assay description: Inhibition of 5-lipoxygenase on rat basophil leukemia cell line lysate (RBL-1 2H3 subline) by measuring 5-HETE production
In DepthDetails ArticlePubMed
TargetPolyunsaturated fatty acid 5-lipoxygenase(Homo sapiens (Human))
Abbott Laboratories
Curated by ChEMBL
LigandPNGBDBM50058565(CHEMBL59298 | N-(cyclohexylmethyl)-N-hydroxyurea)
Affinity DataIC50:  900nM. Assay description: Inhibition of 5-lipoxygenase (5-LO) measured as LTB4 production in human whole blood stimulated with calcium ionophore (A23187).
In DepthDetails ArticlePubMed