BDBM50058582 CHEMBL61874::N-[1-(5-chloro-1-benzofuran-2-yl)ethyl]-N-hydroxyurea
SMILES CC(N(O)C(N)=O)c1cc2cc(Cl)ccc2o1
InChI Key InChIKey=BPZSEQWLJDZAQC-UHFFFAOYSA-N
Data  2 IC50
  Tab Delimited (TSV)   2D SDfile   Computed 3D by Vconf -m prep SDfile
Find this compound or compounds like it in BindingDB:
Activity Spreadsheet -- Enzyme Inhibition Constant Data from BindingDB
Found 2 hits for monomerid = 50058582
TargetPolyunsaturated fatty acid 5-lipoxygenase(Rattus norvegicus)
Abbott Laboratories
Curated by ChEMBL
LigandPNGBDBM50058582(CHEMBL61874 | N-[1-(5-chloro-1-benzofuran-2-yl)eth...)
Affinity DataIC50:  810nM. Assay description: Inhibition of 5-lipoxygenase on rat basophil leukemia cell line lysate (RBL-1 2H3 subline) by measuring 5-HETE production
In DepthDetails ArticlePubMed
TargetPolyunsaturated fatty acid 5-lipoxygenase(Homo sapiens (Human))
Abbott Laboratories
Curated by ChEMBL
LigandPNGBDBM50058582(CHEMBL61874 | N-[1-(5-chloro-1-benzofuran-2-yl)eth...)
Affinity DataIC50:  1.60E+3nM. Assay description: Inhibition of 5-lipoxygenase (5-LO) measured as LTB4 production in human whole blood stimulated with calcium ionophore (A23187).
In DepthDetails ArticlePubMed