BDBM50058585 CHEMBL61583::N-{2-[({(1E)-[5-(4-fluorophenoxy)-2-furyl]methylene}amino)oxy]ethyl}-N-hydroxyurea
SMILES CC(CO\N=C\c1ccc(Oc2ccc(F)cc2)o1)N(O)C(N)=O
InChI Key InChIKey=SHMZBVZFUQIFDH-QGMBQPNBSA-N
Data  1 IC50
  Tab Delimited (TSV)   2D SDfile   Computed 3D by Vconf -m prep SDfile
Find this compound or compounds like it in BindingDB:
Activity Spreadsheet -- Enzyme Inhibition Constant Data from BindingDB
Found 1 hit for monomerid = 50058585
TargetPolyunsaturated fatty acid 5-lipoxygenase(Homo sapiens (Human))
Abbott Laboratories
Curated by ChEMBL
LigandPNGBDBM50058585(CHEMBL61583 | N-{2-[({(1E)-[5-(4-fluorophenoxy)-2-...)
Affinity DataIC50:  110nM. Assay description: Inhibition of 5-lipoxygenase (5-LO) measured as LTB4 production in human whole blood stimulated with calcium ionophore (A23187).
In DepthDetails ArticlePubMed