BDBM50058644 CHEMBL59077::N-[1-(1,1'-biphenyl-4-yl)ethyl]-N-hydroxyurea
SMILES CC(N(O)C(N)=O)c1ccc(cc1)-c1ccccc1
InChI Key InChIKey=ULSOEBPDGJHRSW-UHFFFAOYSA-N
Data  1 IC50
  Tab Delimited (TSV)   2D SDfile   Computed 3D by Vconf -m prep SDfile
Find this compound or compounds like it in BindingDB:
Activity Spreadsheet -- Enzyme Inhibition Constant Data from BindingDB
Found 1 hit for monomerid = 50058644
TargetPolyunsaturated fatty acid 5-lipoxygenase(Rattus norvegicus)
Abbott Laboratories
Curated by ChEMBL
LigandPNGBDBM50058644(CHEMBL59077 | N-[1-(1,1'-biphenyl-4-yl)ethyl]-N-hy...)
Affinity DataIC50:  570nM. Assay description: Inhibition of 5-lipoxygenase on rat basophil leukemia cell line lysate (RBL-1 2H3 subline) by measuring 5-HETE production
In DepthDetails ArticlePubMed