BDBM50059584 CHEMBL267215::N,N-dibenzyl[D-Pro-10]Dyn A-(1-11)
SMILES CC[C@H](C)[C@H](NC(=O)[C@H](CCCNC(N)=N)NC(=O)[C@H](CCCNC(N)=N)NC(=O)[C@H](CC(C)C)NC(=O)[C@H](Cc1ccccc1)NC(=O)CNC(=O)CNC(=O)[C@H](Cc1ccc(O)cc1)N(Cc1ccccc1)Cc1ccccc1)C(=O)N[C@@H](CCCNC(N)=N)C(=O)N1CCC[C@H]1C(=O)N[C@@H](CCCCN)C(O)=O
InChI Key InChIKey=OHPCANLMUJRLSF-GOWLZWIFSA-N
Data  3 KI  2 IC50
  Tab Delimited (TSV)   2D SDfile   Computed 3D by Vconf -m prep SDfile
Find this compound or compounds like it in BindingDB:
Activity Spreadsheet -- Enzyme Inhibition Constant Data from BindingDB
Found 5 hits for monomerid = 50059584
TargetKappa-type opioid receptor(Cavia porcellus (domestic guinea pig))
Oregon State University
Curated by ChEMBL
LigandPNGBDBM50059584(CHEMBL267215 | N,N-dibenzyl[D-Pro-10]Dyn A-(1-11))
Affinity DataKi:  3.66nM. Assay description: Affinity against Opioid receptor kappa 1 was determined by measuring the inhibition of [3H]-bremazocine binding to guinea pig cerebellar membranes
In DepthDetails ArticlePubMed
TargetMu-type opioid receptor(Rattus norvegicus (rat))
Oregon State University
Curated by ChEMBL
LigandPNGBDBM50059584(CHEMBL267215 | N,N-dibenzyl[D-Pro-10]Dyn A-(1-11))
Affinity DataKi:  128nM. Assay description: Affinity against Opioid receptor mu 1 was determined by measuring the inhibition of [3H]-DAMGO binding to rat forebrain membranes
In DepthDetails ArticlePubMed
TargetDelta-type opioid receptor(Rattus norvegicus (rat))
Oregon State University
Curated by ChEMBL
LigandPNGBDBM50059584(CHEMBL267215 | N,N-dibenzyl[D-Pro-10]Dyn A-(1-11))
Affinity DataKi:  2.77E+3nM. Assay description: Affinity against Opioid receptor delta 1 was determined by measuring the inhibition of [3H]-DPDPE binding to rat forebrain membranes
In DepthDetails ArticlePubMed
TargetKappa-type opioid receptor(Cavia porcellus (domestic guinea pig))
Oregon State University
Curated by ChEMBL
LigandPNGBDBM50059584(CHEMBL267215 | N,N-dibenzyl[D-Pro-10]Dyn A-(1-11))
Affinity DataIC50:  43nM. Assay description: Binding affinity of the compound towards Opioid receptor kappa 1 using [3H]-diprenorphine as radioligand in guinea pig cerebellar membrane in absence...
In DepthDetails ArticlePubMed
TargetKappa-type opioid receptor(Cavia porcellus (domestic guinea pig))
Oregon State University
Curated by ChEMBL
LigandPNGBDBM50059584(CHEMBL267215 | N,N-dibenzyl[D-Pro-10]Dyn A-(1-11))
Affinity DataIC50:  391nM. Assay description: Binding affinity of the compound towards Opioid receptor kappa 1 using [3H]-diprenorphine as radioligand in guinea pig cerebellar membrane in presenc...
In DepthDetails ArticlePubMed