BDBM50060996 4'-(trifluoromethyl)-4-biphenylcarboxylic acid::4'-Trifluoromethyl-biphenyl-4-carboxylic acid::CHEMBL108457
SMILES OC(=O)c1ccc(cc1)-c1ccc(cc1)C(F)(F)F
InChI Key InChIKey=JXOFQKVEGRNGLD-UHFFFAOYSA-N
Data  1 IC50  1 Kd
  Tab Delimited (TSV)   2D SDfile   Computed 3D by Vconf -m prep SDfile
Find this compound or compounds like it in BindingDB:
Activity Spreadsheet -- Enzyme Inhibition Constant Data from BindingDB
Found 2 hits for monomerid = 50060996
TargetKinesin-like protein KIF11(Homo sapiens (Human))
Glaxosmithkline
Curated by ChEMBL
LigandPNGBDBM50060996(4'-(trifluoromethyl)-4-biphenylcarboxylic acid | 4...)
Affinity DataIC50: >2.00E+4nM. Assay description: Inhibition of human KSP motor domain by ATPase assay
In DepthDetails ArticlePubMed
TargetRegulatory protein E2(Human papillomavirus type 16)
Abbott Laboratories
Curated by ChEMBL
LigandPNGBDBM50060996(4'-(trifluoromethyl)-4-biphenylcarboxylic acid | 4...)
Affinity DataKd:  1.50E+6nM. Assay description: Dissociation constant after binding to human papillomavirus E2 DNA-binding domain (DBD) by observing the changes in [15N]-HSQC spectra.
In DepthDetails ArticlePubMed