BDBM50062064 1-Dimethylcarbamoyl-3-[4-(2-methyl-imidazo[4,5-c]pyridin-1-ylmethyl)-benzoyl]-1H-indole-4-carboxylic acid benzyl ester::CHEMBL427307
SMILES CN(C)C(=O)n1cc(C(=O)c2ccc(Cn3c(C)nc4cnccc34)cc2)c2c(cccc12)C(=O)OCc1ccccc1
InChI Key InChIKey=CXQFJDRCEWRFQR-UHFFFAOYSA-N
Data  1 KI
  Tab Delimited (TSV)   2D SDfile   Computed 3D by Vconf -m prep SDfile
Find this compound or compounds like it in BindingDB:
Activity Spreadsheet -- Enzyme Inhibition Constant Data from BindingDB
Found 1 hit for monomerid = 50062064
TargetPlatelet-activating factor receptor(Cavia porcellus)
Abbott Laboratories
Curated by ChEMBL
LigandPNGBDBM50062064(1-Dimethylcarbamoyl-3-[4-(2-methyl-imidazo[4,5-c]p...)
Affinity DataKi:  0.860nM. Assay description: Binding potency against Platelet activating factor (PAF) receptor using [3H]-C18-PAF as radioligand on rabbit platelet membranes
In DepthDetails ArticlePubMed