BDBM50063241 CHEMBL159680::N-(2,6-Diisopropyl-phenyl)-2-phenyl-malonamic acid ethyl ester
SMILES CCOC(=O)C(C(=O)Nc1c(cccc1C(C)C)C(C)C)c1ccccc1
InChI Key InChIKey=TXGYVFJZVOKOBB-UHFFFAOYSA-N
Data  1 IC50
  Tab Delimited (TSV)   2D SDfile   Computed 3D by Vconf -m prep SDfile
Find this compound or compounds like it in BindingDB:
Activity Spreadsheet -- Enzyme Inhibition Constant Data from BindingDB
Found 1 hit for monomerid = 50063241
TargetSterol O-acyltransferase 1(Rattus norvegicus)
Warner-Lambert
Curated by ChEMBL
LigandPNGBDBM50063241(CHEMBL159680 | N-(2,6-Diisopropyl-phenyl)-2-phenyl...)
Affinity DataIC50: >5.00E+3nM. Assay description: In vitro Acyl coenzyme A:cholesterol acyltransferase inhibition in hepatic microsomes isolated from cholesterol-fed rats
In DepthDetails ArticlePubMed